Reaction Details
TargetMetabotropic glutamate receptor 5
LigandBDBM50339075
Substrate/Competitorn/a
Meas. Tech.ChEMBL_730111 (CHEMBL1695877)
Ki 440±n/a nM
Citation Zhou, YManka, JTRodriguez, ALWeaver, CDDays, ELVinson, PNJadhav, SHermann, EJJones, CKConn, PJLindsley, CWStauffer, SR Discovery of N-Aryl Piperazines as Selective mGlu(5) Potentiators with Efficacy in a Rodent Model Predictive of Anti-Psychotic Activity. ACS Med Chem Lett1:433-438 (2010) 
 
Metabotropic glutamate receptor 5
Name:Metabotropic glutamate receptor 5
Type:Enzyme
Mol. Mass.:131900.14
Organism:Rattus norvegicus (Rat)
Description:P31424
Residue:1203
BDBM50339075
NameBDBM50339075
Synonyms:Adamantan-1-yl-(4-pyridin-2-yl-piperazin-1-yl)-methanone | CHEMBL1688377
TypeSmall organic molecule
Emp. Form.C18H25N3OS
Mol. Mass.331.476
SMILESO=C(N1CCN(CC1)c1nccs1)C12CC3CC(CC(C3)C1)C2