Reaction Details
TargetRetinoic acid receptor RXR-alpha
LigandBDBM50339081
Substrate/Competitorn/a
Meas. Tech.ChEMBL_730141 (CHEMBL1696021)
EC50 19±n/a nM
Citation Ohsawa, FMorishita, KYamada, SMakishima, MKakuta, H Modification at the Lipophilic Domain of RXR Agonists Differentially Influences Activation of RXR Heterodimers. ACS Med Chem Lett1:521-525 (2010) 
 
Retinoic acid receptor RXR-alpha
Name:Retinoic acid receptor RXR-alpha
Type:PROTEIN
Mol. Mass.:50820.38
Organism:Homo sapiens (Human)
Description:ChEMBL_1456363
Residue:462
BDBM50339081
NameBDBM50339081
Synonyms:6-[Ethyl-(3-isobutoxy-4-isopropylphenyl)amino]nicotinic acid | CHEMBL1688383
TypeSmall organic molecule
Emp. Form.C21H28N2O3
Mol. Mass.356.4586
SMILESCCN(c1ccc(C(C)C)c(OCC(C)C)c1)c1ccc(cn1)C(O)=O