Reaction Details
TargetRetinoic acid receptor RXR-alpha
LigandBDBM50339085
Substrate/Competitorn/a
Meas. Tech.ChEMBL_730141 (CHEMBL1696021)
EC50 160±n/a nM
Citation Ohsawa, FMorishita, KYamada, SMakishima, MKakuta, H Modification at the Lipophilic Domain of RXR Agonists Differentially Influences Activation of RXR Heterodimers. ACS Med Chem Lett1:521-525 (2010) 
 
Retinoic acid receptor RXR-alpha
Name:Retinoic acid receptor RXR-alpha
Type:PROTEIN
Mol. Mass.:50820.38
Organism:Homo sapiens (Human)
Description:ChEMBL_1456363
Residue:462
BDBM50339085
NameBDBM50339085
Synonyms:6-{Ethyl-[4-isopropyl-3-(2,2,2-trifluoroethoxy)phenyl]amino}nicotinic acid | CHEMBL1688387
TypeSmall organic molecule
Emp. Form.C19H21F3N2O3
Mol. Mass.382.3768
SMILESCCN(c1ccc(C(C)C)c(OCC(F)(F)F)c1)c1ccc(cn1)C(O)=O