Reaction Details
TargetRetinoic acid receptor RXR-alpha
LigandBDBM50339090
Substrate/Competitorn/a
Meas. Tech.ChEMBL_730141 (CHEMBL1696021)
EC50 160±n/a nM
Citation Ohsawa, FMorishita, KYamada, SMakishima, MKakuta, H Modification at the Lipophilic Domain of RXR Agonists Differentially Influences Activation of RXR Heterodimers. ACS Med Chem Lett1:521-525 (2010) 
 
Retinoic acid receptor RXR-alpha
Name:Retinoic acid receptor RXR-alpha
Type:PROTEIN
Mol. Mass.:50820.38
Organism:Homo sapiens (Human)
Description:ChEMBL_1456363
Residue:462
BDBM50339090
NameBDBM50339090
Synonyms:6-[(3-Benzyloxy-4-isopropylphenyl)-ethylamino]nicotinic acid | CHEMBL1688392
TypeSmall organic molecule
Emp. Form.C24H26N2O3
Mol. Mass.390.4748
SMILESCCN(c1ccc(C(C)C)c(OCc2ccccc2)c1)c1ccc(cn1)C(O)=O