Reaction Details
TargetBotulinum neurotoxin type A
LigandBDBM50339140
Substrate/Competitorn/a
Meas. Tech.ChEMBL_730992 (CHEMBL1697028)
Ki 1900±n/a nM
Citation Roxas-Duncan, VEnyedy, IMontgomery, VAEccard, VSCarrington, MALai, HGul, NYang, DCSmith, LA Identification and biochemical characterization of small-molecule inhibitors of Clostridium botulinum neurotoxin serotype A. Antimicrob Agents Chemother53:3478-86 (2009) 
 
Botulinum neurotoxin type A
Name:Botulinum neurotoxin type A
Type:PROTEIN
Mol. Mass.:149450.01
Organism:Clostridium botulinum
Description:ChEMBL_1510137
Residue:1296
BDBM50339140
NameBDBM50339140
Synonyms:(6S,9S,12S,15S,18S,21S)-1-amino-6-((R)-2-amino-3-mercaptopropanamido)-15-(4-aminobutyl)-12-((R)-1-hydroxyethyl)-1-imino-9,23-dimethyl-18-(2-(methylthio)ethyl)-7,10,13,16,19-pentaoxo-2,8,11,14,17,20-hexaazatetracosane-21-carboxylic acid CRATKML
TypeSmall organic molecule
Emp. Form.C35H66N12O9S2
Mol. Mass.863.104
SMILES[#6]-[#16]-[#6]-[#6]-[#6@H](-[#7]-[#6](=O)-[#6@H](-[#6]-[#6]-[#6]-[#6]-[#7])-[#7]-[#6](=O)-[#6@@H](-[#7]-[#6](=O)-[#6@H](-[#6])-[#7]-[#6](=O)-[#6@H](-[#6]-[#6]-[#6]\[#7]=[#6](/[#7])-[#7])-[#7]-[#6](=O)-[#6@H](-[#6]-[#16])-[#7]-[#6](-[#6])=O)-[#6@@H](-[#6])-[#8])-[#6](=O)-[#7]-[#6@@H](-[#6]-[#6](-[#6])-[#6])-[#6](-[#7])=O