Reaction Details
TargetBeta-lactamase
LigandBDBM50021959
Substrate/Competitorn/a
Meas. Tech.ChEMBL_733518 (CHEMBL1689856)
IC50>100000±n/a nM
Citation Stachyra, TPéchereau, MCBruneau, JMClaudon, MFrère, JMMiossec, CColeman, KBlack, MT Mechanistic studies of the inactivation of TEM-1 and P99 by NXL104, a novel non-beta-lactam beta-lactamase inhibitor. Antimicrob Agents Chemother54:5132-8 (2010) 
 
Beta-lactamase
Name:Beta-lactamase
Type:Enzyme
Mol. Mass.:43406.87
Organism:Pseudomonas aeruginosa (PAO1)
Description:P24735
Residue:397
BDBM50021959
NameBDBM50021959
Synonyms:CHEMBL777 US9120808, Clavulanic acid potassium salt clavulanic acid
TypeSmall organic molecule
Emp. Form.C8H9NO5
Mol. Mass.199.1608
SMILESOC\C=C1/O[C@@H]2CC(=O)N2[C@H]1C(O)=O