Reaction Details
TargetRibosyldihydronicotinamide dehydrogenase [quinone]
LigandBDBM23926
Substrate/Competitorn/a
Meas. Tech.ChEMBL_735769 (CHEMBL1693919)
IC50 960±n/a nM
Citation Yang, JHKondratyuk, TPJermihov, KCMarler, LEQiu, XChoi, YCao, HYu, RSturdy, MHuang, RLiu, YWang, LQMesecar, ADvan Breemen, RBPezzuto, JMFong, HHChen, YGZhang, HJ Bioactive compounds from the fern Lepisorus contortus. J Nat Prod74:129-36 (2011) 
 
Ribosyldihydronicotinamide dehydrogenase [quinone]
Name:Ribosyldihydronicotinamide dehydrogenase [quinone]
Type:Protein
Mol. Mass.:25917.25
Organism:Homo sapiens (Human)
Description:P16083
Residue:231
BDBM23926
NameBDBM23926
Synonyms:(E)-resveratrol CHEMBL165 Stilbene, 2f cid_445154 trans-resveratrol
TypeSmall organic molecule
Emp. Form.C14H12O3
Mol. Mass.228.2433
SMILESOc1ccc(\C=C\c2cc(O)cc(O)c2)cc1