Reaction Details
TargetAromatase
LigandBDBM50339147
Substrate/Competitorn/a
Meas. Tech.ChEMBL_735765 (CHEMBL1693773)
IC50 30700±n/a nM
Citation Yang, JHKondratyuk, TPJermihov, KCMarler, LEQiu, XChoi, YCao, HYu, RSturdy, MHuang, RLiu, YWang, LQMesecar, ADvan Breemen, RBPezzuto, JMFong, HHChen, YGZhang, HJ Bioactive compounds from the fern Lepisorus contortus. J Nat Prod74:129-36 (2011) 
 
Aromatase
Name:Aromatase
Type:Enzyme
Mol. Mass.:57888.92
Organism:Homo sapiens (Human)
Description:P11511
Residue:503
BDBM50339147
NameBDBM50339147
Synonyms:CHEMBL1689257 | beta-(4-hydroxyphenyl)ethyl-4-O-E-caffeoyl-O-[beta-D-apiofuranosyl-(1->2)]-beta-D-glucopyranoside
TypeSmall organic molecule
Emp. Form.C28H34O14
Mol. Mass.594.5612
SMILESOC[C@H]1O[C@@H](OCCc2ccc(O)cc2)[C@H](O[C@@H]2OC[C@](O)(CO)[C@H]2O)[C@@H](O)[C@@H]1OC(=O)\C=C\c1ccc(O)c(O)c1