Reaction Details
TargetBroad substrate specificity ATP-binding cassette transporter ABCG2
LigandBDBM7459
Substrate/Competitorn/a
Meas. Tech.ChEMBL_735838 (CHEMBL1694230)
IC50 8900±n/a nM
Citation Versiani, MADiyabalanage, TRatnayake, RHenrich, CJBates, SEMcMahon, JBGustafson, KR Flavonoids from eight tropical plant species that inhibit the multidrug resistance transporter ABCG2. J Nat Prod74:262-6 (2011) 
 
Broad substrate specificity ATP-binding cassette transporter ABCG2
Name:Broad substrate specificity ATP-binding cassette transporter ABCG2
Type:Multi-pass membrane protein; monomer or homodimer; disulfide-linked
Mol. Mass.:72329.48
Organism:Homo sapiens (Human)
Description:Q9UNQ0
Residue:655
BDBM7459
NameBDBM7459
Synonyms:2-(3,4-dihydroxyphenyl)-5,7-dihydroxy-4H-chromen-4-one CHEMBL151 Luteolin (4) cid_5280445 med.21724, Compound 3
TypeSmall organic molecule
Emp. Form.C15H10O6
Mol. Mass.286.2363
SMILESOc1cc(O)c2c(c1)oc(cc2=O)-c1ccc(O)c(O)c1