Reaction Details
TargetMu-type opioid receptor
LigandBDBM50339240
Substrate/Competitorn/a
Meas. Tech.ChEMBL_736201 (CHEMBL1693237)
Ki 0.47±n/a nM
Citation Mallareddy, JRBorics, AKeresztes, AKövér, KETourwé, DTóth, G Design, synthesis, pharmacological evaluation, and structure-activity study of novel endomorphin analogues with multiple structural modifications. J Med Chem54:1462-72 (2011) 
 
Mu-type opioid receptor
Name:Mu-type opioid receptor
Type:G Protein-Coupled Receptor (GPCR)
Mol. Mass.:44503.11
Organism:Rattus norvegicus (rat)
Description:Competition binding assays were carried out using membrane preparations from transfected HN9.10 cells that constitutively expressed the mu opioid receptor.
Residue:398
BDBM50339240
NameBDBM50339240
Synonyms:(1S,2R)-N-((S)-1-((2S,3S)-1-amino-1-oxo-3-phenylbutan-2-ylamino)-1-oxo-3-phenylpropan-2-yl)-2-(2-amino-3-(4-hydroxy-3,5-dimethylphenyl)propanamido)cyclohexanecarboxamide | CHEMBL1689548
TypeSmall organic molecule
Emp. Form.C37H47N5O5
Mol. Mass.641.7996
SMILESC[C@H]([C@H](NC(=O)[C@H](Cc1ccccc1)NC(=O)[C@H]1CCCC[C@H]1NC(=O)C(N)Cc1cc(C)c(O)c(C)c1)C(N)=O)c1ccccc1