Reaction Details
TargetMu-type opioid receptor
LigandBDBM50339242
Substrate/Competitorn/a
Meas. Tech.ChEMBL_736201 (CHEMBL1693237)
Ki 0.82±n/a nM
Citation Mallareddy, JRBorics, AKeresztes, AKövér, KETourwé, DTóth, G Design, synthesis, pharmacological evaluation, and structure-activity study of novel endomorphin analogues with multiple structural modifications. J Med Chem54:1462-72 (2011) 
 
Mu-type opioid receptor
Name:Mu-type opioid receptor
Type:G Protein-Coupled Receptor (GPCR)
Mol. Mass.:44503.11
Organism:Rattus norvegicus (rat)
Description:Competition binding assays were carried out using membrane preparations from transfected HN9.10 cells that constitutively expressed the mu opioid receptor.
Residue:398
BDBM50339242
NameBDBM50339242
Synonyms:(1S,2R)-N-((S)-1-((2S,3S)-1-amino-1-oxo-3-phenylbutan-2-ylamino)-1-oxo-3-phenylpropan-2-yl)-2-((S)-2-amino-3-(4-hydroxyphenyl)propanamido)cyclohexanecarboxamide | CHEMBL1689546
TypeSmall organic molecule
Emp. Form.C35H43N5O5
Mol. Mass.613.7464
SMILESC[C@H]([C@H](NC(=O)[C@H](Cc1ccccc1)NC(=O)[C@H]1CCCC[C@H]1NC(=O)[C@@H](N)Cc1ccc(O)cc1)C(N)=O)c1ccccc1