Reaction Details
TargetCysteine proteinase falcipain 3
LigandBDBM50157741
Substrate/Competitorn/a
Meas. Tech.ChEMBL_736242 (CHEMBL1693386)
IC50 481.5±n/a nM
Citation Praveen Kumar, SGut, JGuedes, RCRosenthal, PJSantos, MMMoreira, R Design, synthesis and evaluation of 3-methylene-substituted indolinones as antimalarials. Eur J Med Chem46:927-33 (2011) 
 
Cysteine proteinase falcipain 3
Name:Cysteine proteinase falcipain 3
Synonyms:Cysteine protease falcipain-3
Type:Protein
Mol. Mass.:56666.98
Organism:Plasmodium falciparum
Description:Q9NAW4
Residue:492
BDBM50157741
NameBDBM50157741
TypeSmall organic molecule
Emp. Form.C15H27N5O5
Mol. Mass.357.4054
SMILES[#6]-[#6](-[#6])-[#6]-[#6@H](-[#7]-[#6](=O)-[#6@H]-1-[#8]-[#6@@H]-1-[#6](-[#8])=O)-[#6](=O)-[#7]-[#6]-[#6]-[#6]-[#6]\[#7]=[#6](/[#7])-[#7]