Reaction Details
TargetFalcipain-2
LigandBDBM50339264
Substrate/Competitorn/a
Meas. Tech.ChEMBL_736241 (CHEMBL1693385)
IC50>50000±n/a nM
Citation Praveen Kumar, SGut, JGuedes, RCRosenthal, PJSantos, MMMoreira, R Design, synthesis and evaluation of 3-methylene-substituted indolinones as antimalarials. Eur J Med Chem46:927-33 (2011) 
 
Falcipain-2
Name:Falcipain-2
Synonyms:n/a
Type:Enzyme
Mol. Mass.:55912.57
Organism:Plasmodium falciparum
Description:n/a
Residue:484
BDBM50339264
NameBDBM50339264
TypeSmall organic molecule
Emp. Form.C20H29N3O2
Mol. Mass.343.4632
SMILESCC(C)CCNC(=O)[C@H](CC(C)C)N=CC1C(=O)Nc2ccccc12