Reaction Details
TargetFalcipain-2
LigandBDBM50339269
Substrate/Competitorn/a
Meas. Tech.ChEMBL_736241 (CHEMBL1693385)
IC50>50000±n/a nM
Citation Praveen Kumar, SGut, JGuedes, RCRosenthal, PJSantos, MMMoreira, R Design, synthesis and evaluation of 3-methylene-substituted indolinones as antimalarials. Eur J Med Chem46:927-33 (2011) 
 
Falcipain-2
Name:Falcipain-2
Synonyms:n/a
Type:Enzyme
Mol. Mass.:55912.57
Organism:Plasmodium falciparum
Description:n/a
Residue:484
BDBM50339269
NameBDBM50339269
TypeSmall organic molecule
Emp. Form.C21H18Cl2N4O
Mol. Mass.413.3
SMILESClc1ccc2C(C=NCCCNc3ccnc4cc(Cl)ccc34)C(=O)Nc2c1