Reaction Details
TargetPotassium voltage-gated channel subfamily KQT member 2/3
LigandBDBM50339285
Substrate/Competitorn/a
Meas. Tech.ChEMBL_736251 (CHEMBL1693395)
EC50 6190±n/a nM
Citation Qi, JZhang, FMi, YFu, YXu, WZhang, DWu, YDu, XJia, QWang, KZhang, H Design, synthesis and biological activity of pyrazolo[1,5-a]pyrimidin-7(4H)-ones as novel Kv7/KCNQ potassium channel activators. Eur J Med Chem46:934-43 (2011) 
 
Potassium voltage-gated channel subfamily KQT member 2/3
Name:Potassium voltage-gated channel subfamily KQT member 2/3
Type:n/a
Mol. Mass.:n/a
Description:ASSAY_ID of EBI is 91707
Components:This complex has 3 components.
Component 1
Name:Potassium voltage-gated channel subfamily KQT member 2
Synonyms:KCNQ (Kv7) potassium channel KCNQ2_HUMAN Neuroblastoma-specific potassium channel subunit alpha KvLQT2 Voltage-gated potassium channel subunit Kv7.2
Type:PROTEIN
Mol. Mass.:95883.20
Organism:Homo sapiens (Human)
Description:ChEMBL_1457496
Residue:872
Component 2
Name:Potassium voltage-gated channel subfamily KQT member 3
Synonyms:KCNQ (Kv7) potassium channel KCNQ3_HUMAN | Voltage-gated potassium channel subunit Kv7.3
Type:PROTEIN
Mol. Mass.:96759.41
Organism:Homo sapiens (Human)
Description:ChEMBL_938652
Residue:872
BDBM50339285
NameBDBM50339285
Synonyms:5-tert-Butyl-3-phenyl-2-(trifluoromethyl)pyrazolo[1,5-a]pyrimidin-7(4H)-one | CHEMBL1689658
TypeSmall organic molecule
Emp. Form.C17H16F3N3O
Mol. Mass.335.3236
SMILESCC(C)(C)c1cc(=O)n2[nH]c(c(-c3ccccc3)c2n1)C(F)(F)F