Reaction Details
TargetPotassium voltage-gated channel subfamily KQT member 2/3
LigandBDBM50339294
Substrate/Competitorn/a
Meas. Tech.ChEMBL_736251 (CHEMBL1693395)
EC50 210±n/a nM
Citation Qi, JZhang, FMi, YFu, YXu, WZhang, DWu, YDu, XJia, QWang, KZhang, H Design, synthesis and biological activity of pyrazolo[1,5-a]pyrimidin-7(4H)-ones as novel Kv7/KCNQ potassium channel activators. Eur J Med Chem46:934-43 (2011) 
 
Potassium voltage-gated channel subfamily KQT member 2/3
Name:Potassium voltage-gated channel subfamily KQT member 2/3
Type:n/a
Mol. Mass.:n/a
Description:ASSAY_ID of EBI is 91707
Components:This complex has 3 components.
Component 1
Name:Potassium voltage-gated channel subfamily KQT member 2
Synonyms:KCNQ (Kv7) potassium channel KCNQ2_HUMAN Neuroblastoma-specific potassium channel subunit alpha KvLQT2 Voltage-gated potassium channel subunit Kv7.2
Type:PROTEIN
Mol. Mass.:95883.20
Organism:Homo sapiens (Human)
Description:ChEMBL_1457496
Residue:872
Component 2
Name:Potassium voltage-gated channel subfamily KQT member 3
Synonyms:KCNQ (Kv7) potassium channel KCNQ3_HUMAN | Voltage-gated potassium channel subunit Kv7.3
Type:PROTEIN
Mol. Mass.:96759.41
Organism:Homo sapiens (Human)
Description:ChEMBL_938652
Residue:872
BDBM50339294
NameBDBM50339294
Synonyms:3-(4-Chlorophenyl)-2-(trifluoromethyl)-5-(2,4,5-trifluorophenyl)pyrazolo[1,5-a]pyrimidin-7(4H)-one | CHEMBL1689667
TypeSmall organic molecule
Emp. Form.C19H8ClF6N3O
Mol. Mass.443.73
SMILESFc1cc(F)c(cc1F)-c1cc(=O)n2[nH]c(c(-c3ccc(Cl)cc3)c2n1)C(F)(F)F