Reaction Details
TargetExtracellular calcium-sensing receptor
LigandBDBM50331964
Substrate/Competitorn/a
Meas. Tech.ChEMBL_736451 (CHEMBL1694279)
IC50 10±n/a nM
Citation Yoshida, MMori, AKotani, EOka, MMakino, HFujita, HBan, JIkeda, YKawamoto, TGoto, MKimura, HBaba, AYasuma, T Discovery of novel and potent orally active calcium-sensing receptor antagonists that stimulate pulselike parathyroid hormone secretion: synthesis and structure-activity relationships of tetrahydropyrazolopyrimidine derivatives. J Med Chem54:1430-40 (2011) 
 
Extracellular calcium-sensing receptor
Name:Extracellular calcium-sensing receptor
Type:Protein
Mol. Mass.:120663.13
Organism:Homo sapiens (Human)
Description:P41180
Residue:1078
BDBM50331964
NameBDBM50331964
Synonyms:CHEMBL1290328 | N-(1-Adamantyl)-7,7-dimethyl-5-phenyl-4,5,6,7-tetrahydropyrazolo[1,5-a]-pyrimidine-3-carboxamide
TypeSmall organic molecule
Emp. Form.C25H32N4O
Mol. Mass.404.5478
SMILESCC1(C)C[C@H](Nc2c(cnn12)C(=O)NC12CC3CC(CC(C3)C1)C2)c1ccccc1