Reaction Details
TargetExtracellular calcium-sensing receptor
LigandBDBM50339325
Substrate/Competitorn/a
Meas. Tech.ChEMBL_736451 (CHEMBL1694279)
IC50 4.4±n/a nM
Citation Yoshida, MMori, AKotani, EOka, MMakino, HFujita, HBan, JIkeda, YKawamoto, TGoto, MKimura, HBaba, AYasuma, T Discovery of novel and potent orally active calcium-sensing receptor antagonists that stimulate pulselike parathyroid hormone secretion: synthesis and structure-activity relationships of tetrahydropyrazolopyrimidine derivatives. J Med Chem54:1430-40 (2011) 
 
Extracellular calcium-sensing receptor
Name:Extracellular calcium-sensing receptor
Type:Protein
Mol. Mass.:120663.13
Organism:Homo sapiens (Human)
Description:P41180
Residue:1078
BDBM50339325
NameBDBM50339325
Synonyms:7,7-Dimethyl-5-phenyl-N-{1-propyl-1-[4-(trifluoromethyl)phenyl]-butyl}-4,5,6,7-tetrahydropyrazolo[1,5-a]pyrimidine-3-carboxamide | CHEMBL1689811
TypeSmall organic molecule
Emp. Form.C29H35F3N4O
Mol. Mass.512.6096
SMILESCCCC(CCC)(NC(=O)c1cnn2c1NC(CC2(C)C)c1ccccc1)c1ccc(cc1)C(F)(F)F