Reaction Details
TargetExtracellular calcium-sensing receptor
LigandBDBM50339328
Substrate/Competitorn/a
Meas. Tech.ChEMBL_736451 (CHEMBL1694279)
IC50 150±n/a nM
Citation Yoshida, MMori, AKotani, EOka, MMakino, HFujita, HBan, JIkeda, YKawamoto, TGoto, MKimura, HBaba, AYasuma, T Discovery of novel and potent orally active calcium-sensing receptor antagonists that stimulate pulselike parathyroid hormone secretion: synthesis and structure-activity relationships of tetrahydropyrazolopyrimidine derivatives. J Med Chem54:1430-40 (2011) 
 
Extracellular calcium-sensing receptor
Name:Extracellular calcium-sensing receptor
Type:Protein
Mol. Mass.:120663.13
Organism:Homo sapiens (Human)
Description:P41180
Residue:1078
BDBM50339328
NameBDBM50339328
Synonyms:CHEMBL1689814 | N-{Dicyclohexyl[4-(trifluoromethyl)phenyl]methyl}-7,7-dimethyl-5-phenyl-4,5,6,7-tetrahydropyrazolo[1,5-a]pyrimidine-3-carboxamide
TypeSmall organic molecule
Emp. Form.C35H43F3N4O
Mol. Mass.592.7373
SMILESCC1(C)CC(Nc2c(cnn12)C(=O)NC(C1CCCCC1)(C1CCCCC1)c1ccc(cc1)C(F)(F)F)c1ccccc1