Reaction Details
TargetMelanocortin receptor 3
LigandBDBM50339348
Substrate/Competitorn/a
Meas. Tech.ChEMBL_736470 (CHEMBL1694298)
EC50 2±n/a nM
Citation Singh, AWilczynski, AHolder, JRWitek, RMDirain, MLXiang, ZEdison, ASHaskell-Luevano, C Incorporation of a bioactive reverse-turn heterocycle into a peptide template using solid-phase synthesis to probe melanocortin receptor selectivity and ligand conformations by 2D 1H NMR. J Med Chem54:1379-90 (2011) 
 
Melanocortin receptor 3
Name:Melanocortin receptor 3
Type:PROTEIN
Mol. Mass.:35808.24
Organism:Mus musculus
Description:ChEMBL_1498848
Residue:323
BDBM50339348
NameBDBM50339348
Synonyms:(4R,7S,10S,13S,16S,19S,22R,25S,28R)-25-((1H-imidazol-4-yl)methyl)-16-((1H-indol-3-yl)methyl)-13-(2-amino-2-oxoethyl)-N-((S)-1-amino-3-(4-hydroxyphenyl)-1-oxopropan-2-yl)-28-((S)-2-amino-3-(4-hydroxyphenyl)propanamido)-7,22-dibenzyl-19-(3-guanidinopropyl)-10-methyl-6,9,12,15,18,21,24,27-octaoxo-1,2-dithia-5,8,11,14,17,20,23,26-octaazacyclononacosane-4-carboxamide | CHEMBL1688107
TypeSmall organic molecule
Emp. Form.C72H87N19O14S2
Mol. Mass.1506.71
SMILESC[C@@H]1NC(=O)[C@H](CC(N)=O)NC(=O)[C@H](Cc2c[nH]c3ccccc23)NC(=O)[C@H](CCCN=C(N)N)NC(=O)[C@@H](Cc2ccccc2)NC(=O)[C@H](Cc2cnc[nH]2)NC(=O)[C@H](CSSC[C@H](NC(=O)[C@H](Cc2ccccc2)NC1=O)C(=O)N[C@@H](Cc1ccc(O)cc1)C(N)=O)NC(=O)[C@@H](N)Cc1ccc(O)cc1