Reaction Details
TargetMelanocortin receptor 3
LigandBDBM50339349
Substrate/Competitorn/a
Meas. Tech.ChEMBL_736470 (CHEMBL1694298)
EC50 7600±n/a nM
Citation Singh, AWilczynski, AHolder, JRWitek, RMDirain, MLXiang, ZEdison, ASHaskell-Luevano, C Incorporation of a bioactive reverse-turn heterocycle into a peptide template using solid-phase synthesis to probe melanocortin receptor selectivity and ligand conformations by 2D 1H NMR. J Med Chem54:1379-90 (2011) 
 
Melanocortin receptor 3
Name:Melanocortin receptor 3
Type:PROTEIN
Mol. Mass.:35808.24
Organism:Mus musculus
Description:ChEMBL_1498848
Residue:323
BDBM50339349
NameBDBM50339349
Synonyms:(S)-2-acetamido-N-((R)-1-((6S,9S)-4-((S)-1-amino-3-(1H-indol-3-yl)-1-oxopropan-2-yl)-6-(3-guanidinopropyl)-3,8-dioxo-1,4,7-thiadiazecan-9-ylamino)-1-oxo-3-phenylpropan-2-yl)-3-(1H-imidazol-4-yl)propanamide | CHEMBL1688108
TypeSmall organic molecule
Emp. Form.C39H50N12O6S
Mol. Mass.814.956
SMILESCC(=O)N[C@@H](Cc1cnc[nH]1)C(=O)N[C@H](Cc1ccccc1)C(=O)N[C@@H]1CSCC(=O)N(C[C@H](CCCN=C(N)N)NC1=O)[C@@H](Cc1c[nH]c2ccccc12)C(N)=O