Reaction Details
TargetE3 ubiquitin-protein ligase Mdm2
LigandBDBM50339354
Substrate/Competitorn/a
Meas. Tech.ChEMBL_736488 (CHEMBL1694433)
IC50 450±n/a nM
Citation Hardcastle, IRLiu, JValeur, EWatson, AAhmed, SUBlackburn, TJBennaceur, KClegg, WDrummond, CEndicott, JAGolding, BTGriffin, RJGruber, JHaggerty, KHarrington, RWHutton, CKemp, SLu, XMcDonnell, JMNewell, DRNoble, MEPayne, SLRevill, CHRiedinger, CXu, QLunec, J Isoindolinone inhibitors of the murine double minute 2 (MDM2)-p53 protein-protein interaction: structure-activity studies leading to improved potency. J Med Chem54:1233-43 (2011) 
 
E3 ubiquitin-protein ligase Mdm2
Name:E3 ubiquitin-protein ligase Mdm2
Type:Oncoprotein
Mol. Mass.:55196.54
Organism:Homo sapiens (Human)
Description:Q00987
Residue:491
BDBM50339354
NameBDBM50339354
Synonyms:(+/-)-3-(4-Chlorophenyl)-3-(3-hydroxypropoxy)-2-(4-nitrobenzyl)-2,3-dihydroisoindol-1-one | CHEMBL1688259
TypeSmall organic molecule
Emp. Form.C24H21ClN2O5
Mol. Mass.452.887
SMILESOCCCOC1(N(Cc2ccc(cc2)[N+]([O-])=O)C(=O)c2ccccc12)c1ccc(Cl)cc1