Reaction Details
TargetE3 ubiquitin-protein ligase Mdm2
LigandBDBM50339361
Substrate/Competitorn/a
Meas. Tech.ChEMBL_736488 (CHEMBL1694433)
IC50 570±n/a nM
Citation Hardcastle, IRLiu, JValeur, EWatson, AAhmed, SUBlackburn, TJBennaceur, KClegg, WDrummond, CEndicott, JAGolding, BTGriffin, RJGruber, JHaggerty, KHarrington, RWHutton, CKemp, SLu, XMcDonnell, JMNewell, DRNoble, MEPayne, SLRevill, CHRiedinger, CXu, QLunec, J Isoindolinone inhibitors of the murine double minute 2 (MDM2)-p53 protein-protein interaction: structure-activity studies leading to improved potency. J Med Chem54:1233-43 (2011) 
 
E3 ubiquitin-protein ligase Mdm2
Name:E3 ubiquitin-protein ligase Mdm2
Type:Oncoprotein
Mol. Mass.:55196.54
Organism:Homo sapiens (Human)
Description:Q00987
Residue:491
BDBM50339361
NameBDBM50339361
Synonyms:(+/-)-3-(4-Bromophenyl)-3-(4-hydroxybutoxy)-2-(4-nitrobenzyl)isoindolin-1-one | CHEMBL1688266
TypeSmall organic molecule
Emp. Form.C25H23BrN2O5
Mol. Mass.511.365
SMILESOCCCCOC1(N(Cc2ccc(cc2)[N+]([O-])=O)C(=O)c2ccccc12)c1ccc(Br)cc1