Reaction Details
TargetCarbonic anhydrase 2
LigandBDBM50339444
Substrate/Competitorn/a
Meas. Tech.ChEMBL_736560 (CHEMBL1692289)
Ki 104±n/a nM
Citation Lopez, MTrajkovic, JBornaghi, LFInnocenti, AVullo, DSupuran, CTPoulsen, SA Design, synthesis, and biological evaluation of novel carbohydrate-based sulfamates as carbonic anhydrase inhibitors. J Med Chem54:1481-9 (2011) 
 
Carbonic anhydrase 2
Name:Carbonic anhydrase 2
Type:Enzyme
Mol. Mass.:29250.71
Organism:Homo sapiens (Human)
Description:P00918
Residue:260
BDBM50339444
NameBDBM50339444
Synonyms:6-Sulfamoyl-alpha,beta-D-mannopyranose | CHEMBL1688315
TypeSmall organic molecule
Emp. Form.C6H13NO8S
Mol. Mass.259.234
SMILESNS(=O)(=O)OC[C@H]1OC(O)[C@@H](O)[C@@H](O)[C@@H]1O