Reaction Details
TargetCarbonic anhydrase 2
LigandBDBM50339452
Substrate/Competitorn/a
Meas. Tech.ChEMBL_736560 (CHEMBL1692289)
Ki 105±n/a nM
Citation Lopez, MTrajkovic, JBornaghi, LFInnocenti, AVullo, DSupuran, CTPoulsen, SA Design, synthesis, and biological evaluation of novel carbohydrate-based sulfamates as carbonic anhydrase inhibitors. J Med Chem54:1481-9 (2011) 
 
Carbonic anhydrase 2
Name:Carbonic anhydrase 2
Type:Enzyme
Mol. Mass.:29250.71
Organism:Homo sapiens (Human)
Description:P00918
Residue:260
BDBM50339452
NameBDBM50339452
Synonyms:1,2,3,4-Tetra-O-propionyl-6-sulfamoyl-beta-D-glucopyranose | CHEMBL1688307
TypeSmall organic molecule
Emp. Form.C18H29NO12S
Mol. Mass.483.487
SMILESCCC(=O)O[C@@H]1O[C@H](COS(N)(=O)=O)[C@@H](OC(=O)CC)[C@H](OC(=O)CC)[C@H]1OC(=O)CC