Reaction Details
TargetCarbonic anhydrase 1
LigandBDBM50339448
Substrate/Competitorn/a
Meas. Tech.ChEMBL_736559 (CHEMBL1692288)
Ki 12600±n/a nM
Citation Lopez, MTrajkovic, JBornaghi, LFInnocenti, AVullo, DSupuran, CTPoulsen, SA Design, synthesis, and biological evaluation of novel carbohydrate-based sulfamates as carbonic anhydrase inhibitors. J Med Chem54:1481-9 (2011) 
 
Carbonic anhydrase 1
Name:Carbonic anhydrase 1
Type:Enzyme
Mol. Mass.:28873.37
Organism:Homo sapiens (Human)
Description:P00915
Residue:261
BDBM50339448
NameBDBM50339448
Synonyms:1,2,2',3,3',4',6-Hepta-O-acetyl-6'-sulfamoyl-beta-maltose | CHEMBL1688311
TypeSmall organic molecule
Emp. Form.C26H37NO20S
Mol. Mass.715.632
SMILESCC(=O)OC[C@H]1O[C@@H](OC(C)=O)[C@H](OC(C)=O)[C@@H](OC(C)=O)[C@@H]1O[C@H]1O[C@H](COS(N)(=O)=O)[C@@H](OC(C)=O)[C@H](OC(C)=O)[C@H]1OC(C)=O