Reaction Details
TargetCarbonic anhydrase 1
LigandBDBM50339450
Substrate/Competitorn/a
Meas. Tech.ChEMBL_736559 (CHEMBL1692288)
Ki 860±n/a nM
Citation Lopez, MTrajkovic, JBornaghi, LFInnocenti, AVullo, DSupuran, CTPoulsen, SA Design, synthesis, and biological evaluation of novel carbohydrate-based sulfamates as carbonic anhydrase inhibitors. J Med Chem54:1481-9 (2011) 
 
Carbonic anhydrase 1
Name:Carbonic anhydrase 1
Type:Enzyme
Mol. Mass.:28873.37
Organism:Homo sapiens (Human)
Description:P00915
Residue:261
BDBM50339450
NameBDBM50339450
Synonyms:1,2,3,4-Tetra-O-acetyl-6-sulfamoyl-beta-D-galactopyranose | CHEMBL1688309
TypeSmall organic molecule
Emp. Form.C14H21NO12S
Mol. Mass.427.381
SMILESCC(=O)O[C@@H]1O[C@H](COS(N)(=O)=O)[C@H](OC(C)=O)[C@H](OC(C)=O)[C@H]1OC(C)=O