Reaction Details
TargetCarbonic anhydrase 1
LigandBDBM50339452
Substrate/Competitorn/a
Meas. Tech.ChEMBL_736559 (CHEMBL1692288)
Ki 3360±n/a nM
Citation Lopez, MTrajkovic, JBornaghi, LFInnocenti, AVullo, DSupuran, CTPoulsen, SA Design, synthesis, and biological evaluation of novel carbohydrate-based sulfamates as carbonic anhydrase inhibitors. J Med Chem54:1481-9 (2011) 
 
Carbonic anhydrase 1
Name:Carbonic anhydrase 1
Type:Enzyme
Mol. Mass.:28873.37
Organism:Homo sapiens (Human)
Description:P00915
Residue:261
BDBM50339452
NameBDBM50339452
Synonyms:1,2,3,4-Tetra-O-propionyl-6-sulfamoyl-beta-D-glucopyranose | CHEMBL1688307
TypeSmall organic molecule
Emp. Form.C18H29NO12S
Mol. Mass.483.487
SMILESCCC(=O)O[C@@H]1O[C@H](COS(N)(=O)=O)[C@@H](OC(=O)CC)[C@H](OC(=O)CC)[C@H]1OC(=O)CC