Reaction Details
TargetCarbonic anhydrase 12
LigandBDBM50299573
Substrate/Competitorn/a
Meas. Tech.ChEMBL_736562 (CHEMBL1692291)
Ki 4660±n/a nM
Citation Lopez, MTrajkovic, JBornaghi, LFInnocenti, AVullo, DSupuran, CTPoulsen, SA Design, synthesis, and biological evaluation of novel carbohydrate-based sulfamates as carbonic anhydrase inhibitors. J Med Chem54:1481-9 (2011) 
 
Carbonic anhydrase 12
Name:Carbonic anhydrase 12
Type:Enzyme
Mol. Mass.:39456.00
Organism:Homo sapiens (Human)
Description:Catalytic domain of human cloned isozyme was used in the assay
Residue:354
BDBM50299573
NameBDBM50299573
Synonyms:(2R,3R,4S,5R,6S)-2-(acetoxymethyl)-6-sulfamoyltetrahydro-2H-pyran-3,4,5-triyl triacetate | CHEMBL568705
TypeSmall organic molecule
Emp. Form.C14H21NO11S
Mol. Mass.411.382
SMILESCC(=O)OC[C@H]1O[C@H]([C@H](OC(C)=O)[C@@H](OC(C)=O)[C@@H]1OC(C)=O)S(N)(=O)=O