Reaction Details
TargetCarbonic anhydrase 12
LigandBDBM50339445
Substrate/Competitorn/a
Meas. Tech.ChEMBL_736562 (CHEMBL1692291)
Ki 7.6±n/a nM
Citation Lopez, MTrajkovic, JBornaghi, LFInnocenti, AVullo, DSupuran, CTPoulsen, SA Design, synthesis, and biological evaluation of novel carbohydrate-based sulfamates as carbonic anhydrase inhibitors. J Med Chem54:1481-9 (2011) 
 
Carbonic anhydrase 12
Name:Carbonic anhydrase 12
Type:Enzyme
Mol. Mass.:39456.00
Organism:Homo sapiens (Human)
Description:Catalytic domain of human cloned isozyme was used in the assay
Residue:354
BDBM50339445
NameBDBM50339445
Synonyms:6-Sulfamoyl-alpha,beta-D-galactopyranose | CHEMBL1688314
TypeSmall organic molecule
Emp. Form.C6H13NO8S
Mol. Mass.259.234
SMILESNS(=O)(=O)OC[C@H]1OC(O)[C@H](O)[C@@H](O)[C@H]1O