Reaction Details
TargetCarbonic anhydrase 12
LigandBDBM50339452
Substrate/Competitorn/a
Meas. Tech.ChEMBL_736562 (CHEMBL1692291)
Ki 96±n/a nM
Citation Lopez, MTrajkovic, JBornaghi, LFInnocenti, AVullo, DSupuran, CTPoulsen, SA Design, synthesis, and biological evaluation of novel carbohydrate-based sulfamates as carbonic anhydrase inhibitors. J Med Chem54:1481-9 (2011) 
 
Carbonic anhydrase 12
Name:Carbonic anhydrase 12
Type:Enzyme
Mol. Mass.:39456.00
Organism:Homo sapiens (Human)
Description:Catalytic domain of human cloned isozyme was used in the assay
Residue:354
BDBM50339452
NameBDBM50339452
Synonyms:1,2,3,4-Tetra-O-propionyl-6-sulfamoyl-beta-D-glucopyranose | CHEMBL1688307
TypeSmall organic molecule
Emp. Form.C18H29NO12S
Mol. Mass.483.487
SMILESCCC(=O)O[C@@H]1O[C@H](COS(N)(=O)=O)[C@@H](OC(=O)CC)[C@H](OC(=O)CC)[C@H]1OC(=O)CC