Reaction Details
TargetCarbonic anhydrase 9
LigandBDBM50299577
Substrate/Competitorn/a
Meas. Tech.ChEMBL_736561 (CHEMBL1692290)
Ki 4080±n/a nM
Citation Lopez, MTrajkovic, JBornaghi, LFInnocenti, AVullo, DSupuran, CTPoulsen, SA Design, synthesis, and biological evaluation of novel carbohydrate-based sulfamates as carbonic anhydrase inhibitors. J Med Chem54:1481-9 (2011) 
 
Carbonic anhydrase 9
Name:Carbonic anhydrase 9
Type:Enzyme
Mol. Mass.:49669.03
Organism:Homo sapiens (Human)
Description:Catalytic domain of human cloned isozyme was used in the assay
Residue:459
BDBM50299577
NameBDBM50299577
Synonyms:(2R,3R,4S,5R,6R)-2-(acetoxymethyl)-6-((2R,3R,4S,5R,6S)-4,5-diacetoxy-2-(acetoxymethyl)-6-sulfamoyltetrahydro-2H-pyran-3-yloxy)tetrahydro-2H-pyran-3,4,5-triyl triacetate | CHEMBL573460
TypeSmall organic molecule
Emp. Form.C26H37NO19S
Mol. Mass.699.632
SMILESCC(=O)OC[C@H]1O[C@H](O[C@@H]2[C@@H](COC(C)=O)O[C@H]([C@H](OC(C)=O)[C@H]2OC(C)=O)S(N)(=O)=O)[C@H](OC(C)=O)[C@@H](OC(C)=O)[C@@H]1OC(C)=O