Reaction Details
TargetCarbonic anhydrase 9
LigandBDBM50339443
Substrate/Competitorn/a
Meas. Tech.ChEMBL_736561 (CHEMBL1692290)
Ki 497±n/a nM
Citation Lopez, MTrajkovic, JBornaghi, LFInnocenti, AVullo, DSupuran, CTPoulsen, SA Design, synthesis, and biological evaluation of novel carbohydrate-based sulfamates as carbonic anhydrase inhibitors. J Med Chem54:1481-9 (2011) 
 
Carbonic anhydrase 9
Name:Carbonic anhydrase 9
Type:Enzyme
Mol. Mass.:49669.03
Organism:Homo sapiens (Human)
Description:Catalytic domain of human cloned isozyme was used in the assay
Residue:459
BDBM50339443
NameBDBM50339443
Synonyms:6'-Sulfamoyl-alpha,beta-maltose | CHEMBL1688316
TypeSmall organic molecule
Emp. Form.C12H23NO13S
Mol. Mass.421.375
SMILESNS(=O)(=O)OC[C@H]1O[C@H](O[C@H]2[C@H](O)[C@@H](O)[C@H](O)O[C@@H]2CO)[C@H](O)[C@@H](O)[C@@H]1O