Reaction Details
TargetCarbonic anhydrase 9
LigandBDBM50339449
Substrate/Competitorn/a
Meas. Tech.ChEMBL_736561 (CHEMBL1692290)
Ki 7.8±n/a nM
Citation Lopez, MTrajkovic, JBornaghi, LFInnocenti, AVullo, DSupuran, CTPoulsen, SA Design, synthesis, and biological evaluation of novel carbohydrate-based sulfamates as carbonic anhydrase inhibitors. J Med Chem54:1481-9 (2011) 
 
Carbonic anhydrase 9
Name:Carbonic anhydrase 9
Type:Enzyme
Mol. Mass.:49669.03
Organism:Homo sapiens (Human)
Description:Catalytic domain of human cloned isozyme was used in the assay
Residue:459
BDBM50339449
NameBDBM50339449
Synonyms:1,2,3,4-Tetra-O-acetyl-6-sulfamoyl-beta-D-mannopyranose | CHEMBL1688310
TypeSmall organic molecule
Emp. Form.C14H21NO12S
Mol. Mass.427.381
SMILESCC(=O)O[C@@H]1O[C@H](COS(N)(=O)=O)[C@@H](OC(C)=O)[C@H](OC(C)=O)[C@@H]1OC(C)=O