Reaction Details
TargetFree fatty acid receptor 1
LigandBDBM50339462
Substrate/Competitorn/a
Meas. Tech.ChEMBL_736594 (CHEMBL1692323)
EC50 40±n/a nM
Citation Sasaki, SKitamura, SNegoro, NSuzuki, MTsujihata, YSuzuki, NSantou, TKanzaki, NHarada, MTanaka, YKobayashi, MTada, NFunami, MTanaka, TYamamoto, YFukatsu, KYasuma, TMomose, Y Design, synthesis, and biological activity of potent and orally available G protein-coupled receptor 40 agonists. J Med Chem54:1365-78 (2011) 
 
Free fatty acid receptor 1
Name:Free fatty acid receptor 1
Type:G Protein-Coupled Receptor (GPCR)
Mol. Mass.:31473.32
Organism:Homo sapiens (Human)
Description:O14842
Residue:300
BDBM50339462
NameBDBM50339462
Synonyms:3-(4-{[3-(4-Methylphenoxy)benzyl]oxy}phenyl)propanoic Acid | CHEMBL1688459
TypeSmall organic molecule
Emp. Form.C23H22O4
Mol. Mass.362.4184
SMILESCc1ccc(Oc2cccc(COc3ccc(CCC(O)=O)cc3)c2)cc1