Reaction Details
TargetFree fatty acid receptor 1
LigandBDBM50339464
Substrate/Competitorn/a
Meas. Tech.ChEMBL_736594 (CHEMBL1692323)
EC50 38±n/a nM
Citation Sasaki, SKitamura, SNegoro, NSuzuki, MTsujihata, YSuzuki, NSantou, TKanzaki, NHarada, MTanaka, YKobayashi, MTada, NFunami, MTanaka, TYamamoto, YFukatsu, KYasuma, TMomose, Y Design, synthesis, and biological activity of potent and orally available G protein-coupled receptor 40 agonists. J Med Chem54:1365-78 (2011) 
 
Free fatty acid receptor 1
Name:Free fatty acid receptor 1
Type:G Protein-Coupled Receptor (GPCR)
Mol. Mass.:31473.32
Organism:Homo sapiens (Human)
Description:O14842
Residue:300
BDBM50339464
NameBDBM50339464
Synonyms:3-(4-{[3-(2-Methylphenoxy)benzyl]oxy}phenyl)propanoic Acid | CHEMBL1688461
TypeSmall organic molecule
Emp. Form.C23H22O4
Mol. Mass.362.4184
SMILESCc1ccccc1Oc1cccc(COc2ccc(CCC(O)=O)cc2)c1