Reaction Details
TargetCarbonic anhydrase 1
LigandBDBM26187
Substrate/Competitorn/a
Meas. Tech.ChEMBL_736726 (CHEMBL1695107)
Ki 10100±n/a nM
Citation Davis, RAHofmann, AOsman, AHall, RAMühlschlegel, FAVullo, DInnocenti, ASupuran, CTPoulsen, SA Natural product-based phenols as novel probes for mycobacterial and fungal carbonic anhydrases. J Med Chem54:1682-92 (2011) 
 
Carbonic anhydrase 1
Name:Carbonic anhydrase 1
Type:Enzyme
Mol. Mass.:28873.37
Organism:Homo sapiens (Human)
Description:P00915
Residue:261
BDBM26187
NameBDBM26187
Synonyms:α-CA inhibitor, 11 US9688816, 2 | phenol
TypeSmall organic molecule
Emp. Form.C6H6O
Mol. Mass.94.1112
SMILESOc1ccccc1