Reaction Details
TargetCarbonic anhydrase 2
LigandBDBM50339586
Substrate/Competitorn/a
Meas. Tech.ChEMBL_736727 (CHEMBL1695108)
Ki 10300±n/a nM
Citation Davis, RAHofmann, AOsman, AHall, RAMühlschlegel, FAVullo, DInnocenti, ASupuran, CTPoulsen, SA Natural product-based phenols as novel probes for mycobacterial and fungal carbonic anhydrases. J Med Chem54:1682-92 (2011) 
 
Carbonic anhydrase 2
Name:Carbonic anhydrase 2
Type:Enzyme
Mol. Mass.:29250.71
Organism:Homo sapiens (Human)
Description:P00918
Residue:260
BDBM50339586
NameBDBM50339586
Synonyms:2-(4-hydroxyphenyl)acetic acid 4-Hydroxyphenylacetic acid | CHEMBL1772
TypeSmall organic molecule
Emp. Form.C8H8O3
Mol. Mass.152.1473
SMILESOC(=O)Cc1ccc(O)cc1