Reaction Details
TargetCarbonic anhydrase 2
LigandBDBM50339589
Substrate/Competitorn/a
Meas. Tech.ChEMBL_736727 (CHEMBL1695108)
Ki 131000±n/a nM
Citation Davis, RAHofmann, AOsman, AHall, RAMühlschlegel, FAVullo, DInnocenti, ASupuran, CTPoulsen, SA Natural product-based phenols as novel probes for mycobacterial and fungal carbonic anhydrases. J Med Chem54:1682-92 (2011) 
 
Carbonic anhydrase 2
Name:Carbonic anhydrase 2
Type:Enzyme
Mol. Mass.:29250.71
Organism:Homo sapiens (Human)
Description:P00918
Residue:260
BDBM50339589
NameBDBM50339589
Synonyms:2-(3-chloro-4-hydroxyphenyl)acetamide | CHEMBL592140
TypeSmall organic molecule
Emp. Form.C8H8ClNO2
Mol. Mass.185.608
SMILESNC(=O)Cc1ccc(O)c(Cl)c1