Reaction Details
TargetCarbonic anhydrase 2
LigandBDBM50339603
Substrate/Competitorn/a
Meas. Tech.ChEMBL_736727 (CHEMBL1695108)
Ki 10800±n/a nM
Citation Davis, RAHofmann, AOsman, AHall, RAMühlschlegel, FAVullo, DInnocenti, ASupuran, CTPoulsen, SA Natural product-based phenols as novel probes for mycobacterial and fungal carbonic anhydrases. J Med Chem54:1682-92 (2011) 
 
Carbonic anhydrase 2
Name:Carbonic anhydrase 2
Type:Enzyme
Mol. Mass.:29250.71
Organism:Homo sapiens (Human)
Description:P00918
Residue:260
BDBM50339603
NameBDBM50339603
Synonyms:CHEMBL578932 | N-tert-butyl-2-(3-chloro-4-hydroxyphenyl)acetamide
TypeSmall organic molecule
Emp. Form.C12H16ClNO2
Mol. Mass.241.714
SMILESCC(C)(C)NC(=O)Cc1ccc(O)c(Cl)c1