Reaction Details
TargetCarbonic anhydrase
LigandBDBM50339602
Substrate/Competitorn/a
Meas. Tech.ChEMBL_736722 (CHEMBL1695103)
Ki 1140±n/a nM
Citation Davis, RAHofmann, AOsman, AHall, RAMühlschlegel, FAVullo, DInnocenti, ASupuran, CTPoulsen, SA Natural product-based phenols as novel probes for mycobacterial and fungal carbonic anhydrases. J Med Chem54:1682-92 (2011) 
 
Carbonic anhydrase
Name:Carbonic anhydrase
Synonyms:PROBABLE TRANSMEMBRANE CARBONIC ANHYDRASE (CARBONATE DEHYDRATASE) (CARBONIC DEHYDRATASE)
Type:PROTEIN
Mol. Mass.:80567.22
Organism:Mycobacterium tuberculosis
Description:ChEMBL_878775
Residue:764
BDBM50339602
NameBDBM50339602
TypeSmall organic molecule
Emp. Form.C11H14ClNO3
Mol. Mass.243.687
SMILESCOCCNC(=O)Cc1ccc(O)c(Cl)c1