Reaction Details
TargetCarbonic anhydrase
LigandBDBM50339592
Substrate/Competitorn/a
Meas. Tech.ChEMBL_736722 (CHEMBL1695103)
Ki 910±n/a nM
Citation Davis, RAHofmann, AOsman, AHall, RAMühlschlegel, FAVullo, DInnocenti, ASupuran, CTPoulsen, SA Natural product-based phenols as novel probes for mycobacterial and fungal carbonic anhydrases. J Med Chem54:1682-92 (2011) 
 
Carbonic anhydrase
Name:Carbonic anhydrase
Synonyms:PROBABLE TRANSMEMBRANE CARBONIC ANHYDRASE (CARBONATE DEHYDRATASE) (CARBONIC DEHYDRATASE)
Type:PROTEIN
Mol. Mass.:80567.22
Organism:Mycobacterium tuberculosis
Description:ChEMBL_878775
Residue:764
BDBM50339592
NameBDBM50339592
TypeSmall organic molecule
Emp. Form.C11H11N3O3
Mol. Mass.233.2233
SMILESCOc1cc(C=C2N=C(N)NC2=O)ccc1O