Reaction Details
TargetCarbonic anhydrase
LigandBDBM50339597
Substrate/Competitorn/a
Meas. Tech.ChEMBL_736724 (CHEMBL1695105)
Ki 780±n/a nM
Citation Davis, RAHofmann, AOsman, AHall, RAMühlschlegel, FAVullo, DInnocenti, ASupuran, CTPoulsen, SA Natural product-based phenols as novel probes for mycobacterial and fungal carbonic anhydrases. J Med Chem54:1682-92 (2011) 
 
Carbonic anhydrase
Name:Carbonic anhydrase
Type:Enzyme
Mol. Mass.:31587.59
Organism:Candida albicans (Yeast)
Description:n/a
Residue:281
BDBM50339597
NameBDBM50339597
Synonyms:CHEMBL589354 | N-benzyl-2-(3-chloro-4-hydroxyphenyl)acetamide
TypeSmall organic molecule
Emp. Form.C15H14ClNO2
Mol. Mass.275.73
SMILESOc1ccc(CC(=O)NCc2ccccc2)cc1Cl