Reaction Details
TargetCarbonic anhydrase
LigandBDBM50339600
Substrate/Competitorn/a
Meas. Tech.ChEMBL_736724 (CHEMBL1695105)
Ki 750±n/a nM
Citation Davis, RAHofmann, AOsman, AHall, RAMühlschlegel, FAVullo, DInnocenti, ASupuran, CTPoulsen, SA Natural product-based phenols as novel probes for mycobacterial and fungal carbonic anhydrases. J Med Chem54:1682-92 (2011) 
 
Carbonic anhydrase
Name:Carbonic anhydrase
Type:Enzyme
Mol. Mass.:31587.59
Organism:Candida albicans (Yeast)
Description:n/a
Residue:281
BDBM50339600
NameBDBM50339600
Synonyms:2-(3-chloro-4-hydroxyphenyl)-N-(3,4-dimethoxyphenethyl)acetamide | CHEMBL589604
TypeSmall organic molecule
Emp. Form.C18H20ClNO4
Mol. Mass.349.809
SMILESCOc1ccc(CCNC(=O)Cc2ccc(O)c(Cl)c2)cc1OC