Reaction Details
TargetCarbonic anhydrase
LigandBDBM50339591
Substrate/Competitorn/a
Meas. Tech.ChEMBL_736725 (CHEMBL1695106)
Ki 1110±n/a nM
Citation Davis, RAHofmann, AOsman, AHall, RAMühlschlegel, FAVullo, DInnocenti, ASupuran, CTPoulsen, SA Natural product-based phenols as novel probes for mycobacterial and fungal carbonic anhydrases. J Med Chem54:1682-92 (2011) 
 
Carbonic anhydrase
Name:Carbonic anhydrase
Synonyms:Carbonic Anhydrase 2 (Can2)
Type:Enzyme
Mol. Mass.:26594.37
Organism:Cryptococcus neoformans var. grubii (Filobasidiella neoformans var. grubii)
Description:n/a
Residue:239
BDBM50339591
NameBDBM50339591
TypeSmall organic molecule
Emp. Form.C14H14ClNO6
Mol. Mass.327.717
SMILESCOC(=O)\C=C\C(=O)N[C@@H](Cc1ccc(O)c(Cl)c1)C(O)=O