Reaction Details
TargetCarbonic anhydrase
LigandBDBM50216276
Substrate/Competitorn/a
Meas. Tech.ChEMBL_736725 (CHEMBL1695106)
Ki 810±n/a nM
Citation Davis, RAHofmann, AOsman, AHall, RAMühlschlegel, FAVullo, DInnocenti, ASupuran, CTPoulsen, SA Natural product-based phenols as novel probes for mycobacterial and fungal carbonic anhydrases. J Med Chem54:1682-92 (2011) 
 
Carbonic anhydrase
Name:Carbonic anhydrase
Synonyms:Carbonic Anhydrase 2 (Can2)
Type:Enzyme
Mol. Mass.:26594.37
Organism:Cryptococcus neoformans var. grubii (Filobasidiella neoformans var. grubii)
Description:n/a
Residue:239
BDBM50216276
NameBDBM50216276
TypeSmall organic molecule
Emp. Form.C20H26O4
Mol. Mass.330.418
SMILESCOc1cc(C[C@@H](C)[C@H](C)Cc2ccc(O)c(OC)c2)ccc1O