Reaction Details
TargetCarbonic anhydrase
LigandBDBM50339603
Substrate/Competitorn/a
Meas. Tech.ChEMBL_736725 (CHEMBL1695106)
Ki 910±n/a nM
Citation Davis, RAHofmann, AOsman, AHall, RAMühlschlegel, FAVullo, DInnocenti, ASupuran, CTPoulsen, SA Natural product-based phenols as novel probes for mycobacterial and fungal carbonic anhydrases. J Med Chem54:1682-92 (2011) 
 
Carbonic anhydrase
Name:Carbonic anhydrase
Synonyms:Carbonic Anhydrase 2 (Can2)
Type:Enzyme
Mol. Mass.:26594.37
Organism:Cryptococcus neoformans var. grubii (Filobasidiella neoformans var. grubii)
Description:n/a
Residue:239
BDBM50339603
NameBDBM50339603
TypeSmall organic molecule
Emp. Form.C12H16ClNO2
Mol. Mass.241.714
SMILESCC(C)(C)NC(=O)Cc1ccc(O)c(Cl)c1