Reaction Details
TargetCarbonic anhydrase
LigandBDBM10887
Substrate/Competitorn/a
Meas. Tech.ChEMBL_736725 (CHEMBL1695106)
Ki 370±n/a nM
Citation Davis, RAHofmann, AOsman, AHall, RAMühlschlegel, FAVullo, DInnocenti, ASupuran, CTPoulsen, SA Natural product-based phenols as novel probes for mycobacterial and fungal carbonic anhydrases. J Med Chem54:1682-92 (2011) 
 
Carbonic anhydrase
Name:Carbonic anhydrase
Synonyms:Carbonic Anhydrase 2 (Can2)
Type:Enzyme
Mol. Mass.:26594.37
Organism:Cryptococcus neoformans var. grubii (Filobasidiella neoformans var. grubii)
Description:n/a
Residue:239
BDBM10887
NameBDBM10887
TypeSmall organic molecule
Emp. Form.C12H21NO8S
Mol. Mass.339.362
SMILESCC1(C)O[C@@H]2CO[C@@]3(COS(N)(=O)=O)OC(C)(C)O[C@H]3[C@@H]2O1