Reaction Details
TargetCarbonic anhydrase 1
LigandBDBM50339601
Substrate/Competitorn/a
Meas. Tech.ChEMBL_736726 (CHEMBL1695107)
Ki 700±n/a nM
Citation Davis, RAHofmann, AOsman, AHall, RAMühlschlegel, FAVullo, DInnocenti, ASupuran, CTPoulsen, SA Natural product-based phenols as novel probes for mycobacterial and fungal carbonic anhydrases. J Med Chem54:1682-92 (2011) 
 
Carbonic anhydrase 1
Name:Carbonic anhydrase 1
Type:Enzyme
Mol. Mass.:28873.37
Organism:Homo sapiens (Human)
Description:P00915
Residue:261
BDBM50339601
NameBDBM50339601
Synonyms:2-(3-chloro-4-hydroxyphenyl)-N-(4-sulfamoylphenethyl)acetamide CHEMBL606453
TypeSmall organic molecule
Emp. Form.C16H17ClN2O4S
Mol. Mass.368.835
SMILESNS(=O)(=O)c1ccc(CCNC(=O)Cc2ccc(O)c(Cl)c2)cc1