Reaction Details
TargetCarbonic anhydrase
LigandBDBM10888
Substrate/Competitorn/a
Meas. Tech.ChEMBL_736722 (CHEMBL1695103)
Ki 210±n/a nM
Citation Davis, RAHofmann, AOsman, AHall, RAMühlschlegel, FAVullo, DInnocenti, ASupuran, CTPoulsen, SA Natural product-based phenols as novel probes for mycobacterial and fungal carbonic anhydrases. J Med Chem54:1682-92 (2011) 
 
Carbonic anhydrase
Name:Carbonic anhydrase
Synonyms:PROBABLE TRANSMEMBRANE CARBONIC ANHYDRASE (CARBONATE DEHYDRATASE) (CARBONIC DEHYDRATASE)
Type:PROTEIN
Mol. Mass.:80567.22
Organism:Mycobacterium tuberculosis
Description:ChEMBL_878775
Residue:764
BDBM10888
NameBDBM10888
TypeSmall organic molecule
Emp. Form.C8H8N2O3S
Mol. Mass.212.226
SMILESNS(=O)(=O)Cc1noc2ccccc12